{"text_format":"3","workbook":"xlsx","n_sheets":2,"sheets":["Individuelle forhandlinger","Kilde"],"not_rendered":{"comments":1},"read":"whole","date_system":"1900"}

{"sheet":"Individuelle forhandlinger","index":0,"n_rows":46,"n_cols":83,"rows_kept":46,"merged":[[0,0,0,10],[0,11,46,11],[0,12,0,18],[0,20,0,26],[0,27,46,27],[0,28,0,34],[0,36,0,42],[0,43,46,43],[0,44,0,50],[0,52,0,58],[0,59,46,59],[0,60,0,66],[0,68,0,74],[0,75,46,75],[0,76,0,82]]}
["Nåværende lønn og stilling",{"$nulls":10},"Kravutveksling ","Akademikerforbundets krav  ",{"$nulls":7},"Arbeidsgivers krav  ",{"$nulls":6},"Runde 1","TILBUD 1",{"$nulls":7},"KRAV 2",{"$nulls":6},"Runde 2","TILBUD 2",{"$nulls":7},"KRAV 3",{"$nulls":6},"Runde 3","TILBUD 3",{"$nulls":7},"KRAV 4",{"$nulls":6},"Runde 4","TILBUD 4/ RESULTAT"]
["Gen. tillegg %",{"v":1,"d":"1.00"},{"$nulls":4},"Lønnsmasse: ",{"$f":"SUM(H4:H46)","v":{"v":1300000,"d":"kr 1,300,000.00"}},{"$f":"SUM(I4:I46)","v":{"v":13000,"d":"kr 13,000.00"}},{"$f":"SUM(J4:J46)","v":{"v":1313000,"d":"kr 1,313,000.00"}},{"$nulls":3},"Ind. Krav totalt: ",{"$f":"SUM(O4:O46)","v":{"v":60000,"d":"kr 60,000.00"}},{"$nulls":6},"Ind. Krav totalt: ",{"$f":"SUM(W4:W46)","v":{"v":30000,"d":"kr 30,000.00"}},{"$nulls":6},"Ind. Krav totalt: ",{"$f":"SUM(AE4:AE46)","v":{"v":17500,"d":"kr 17,500.00"}},{"$nulls":6},"Ind. Krav totalt: ",{"$f":"SUM(AM4:AM46)","v":{"v":47500,"d":"kr 47,500.00"}},{"$nulls":6},"Ind. Krav totalt: ",{"$f":"SUM(AU4:AU46)","v":{"v":25000,"d":"kr 25,000.00"}},{"$nulls":6},"Ind. Krav totalt: ",{"$f":"SUM(BC4:BC46)","v":{"v":32000,"d":"kr 32,000.00"}},{"$nulls":6},"Ind. Krav totalt: ",{"$f":"SUM(BK4:BK46)","v":{"v":27250,"d":"kr 27,250.00"}},{"$nulls":6},"Ind. Krav totalt: ",{"$f":"SUM(BS4:BS46)","v":{"v":30000,"d":"kr 30,000.00"}},{"$nulls":6},"Ind. Krav totalt: ",{"$f":"SUM(CA4:CA46)","v":{"v":30000,"d":"kr 30,000.00"}}]
["Navn","Mann/Kvinne","Stilling","Prioritet ","Lønnsstige","Lønnsansiennitet (år)","Stillingsprosent","Årslønn","Genenerelt tillegg","Ny lønn etter gen. tillegg",null,null,"Stilling ","Stillingsprosent","Indivduelt krav","Krav om ny årslønn","Økning i %","Total økning i kr ","Total økning i %","< DIFF >","Stilling ","Stillingsprosent","Indivduelt krav","Krav om ny årslønn","Økning i %","Total økning i kr ","Total økning i %",null,"Stilling ","Stillingsprosent","Indivduelt krav","Krav om ny årslønn","Økning i %","Total økning i kr ","Total økning i %","< DIFF >","Stilling ","Stillingsprosent","Indivduelt krav","Krav om ny årslønn","Økning i %","Total økning i kr ","Total økning i %",null,"Stilling ","Stillingsprosent","Indivduelt krav","Krav om ny årslønn","Økning i %","Total økning i kr ","Total økning i %","< DIFF >","Stilling ","Stillingsprosent","Indivduelt krav","Krav om ny årslønn","Økning i %","Total økning i kr ","Total økning i %",null,"Stilling ","Stillingsprosent","Indivduelt krav","Krav om ny årslønn","Økning i %","Total økning i kr ","Total økning i %","< DIFF >","Stilling ","Stillingsprosent","Indivduelt krav","Krav om ny årslønn","Økning i %","Total økning i kr ","Total økning i %",null,"Stilling ","Stillingsprosent","Indivduelt krav","Krav om ny årslønn","Økning i %","Total økning i kr ","Total økning i %"]
["NN","Mann ","Sekretær",1,{"$f":"VLOOKUP(C4,Kilde!$D$2:$E$444,2)","v":"Direkte pl. "},16,{"v":1,"d":"100%"},{"v":600000,"d":"kr 600,000.00"},{"$f":"H4*$B$2/100","v":{"v":6000,"d":"kr 6,000.00"}},{"$f":"I4+H4","v":{"v":606000,"d":"kr 606,000.00"}},null,null,"Seniorrådgiver",{"v":1,"d":"100%"},{"v":50000,"d":"kr 50,000.00"},{"$f":"$O4+$J4","v":{"v":656000,"d":"kr 656,000.00"}},{"$f":"$O4/$J4","v":{"v":0.08250825082508251,"d":"8.25%"}},{"$f":"$P4-$H4","v":{"v":56000,"d":"kr 56,000.00"}},{"$f":"$R4/$H4","v":{"v":0.09333333333333334,"d":"9.33%"}},{"$f":"O4-W4","v":{"v":25000,"d":"kr 25,000.00"}},"Seniorrådgiver",{"v":1,"d":"100%"},{"v":25000,"d":"kr 25,000.00"},{"$f":"$W4+$J4","v":{"v":631000,"d":"kr 631,000.00"}},{"$f":"$W4/$J4","v":{"v":0.041254125412541254,"d":"4.13%"}},{"$f":"$X4-$H4","v":{"v":31000,"d":"kr 31,000.00"}},{"$f":"$Z4/$H4","v":{"v":0.051666666666666666,"d":"5.17%"}},null,"Seniorrådgiver",{"v":1,"d":"100%"},{"v":15000,"d":"kr 15,000.00"},{"$f":"$AE4+$J4","v":{"v":621000,"d":"kr 621,000.00"}},{"$f":"$AE4/$J4","v":{"v":0.024752475247524754,"d":"2.48%"}},{"$f":"$AF4-$H4","v":{"v":21000,"d":"kr 21,000.00"}},{"$f":"$AH4/$H4","v":{"v":0.035,"d":"3.50%"}},{"$f":"AE4-AM4","v":{"v":-25000,"d":"-kr 25,000.00"}},"Seniorrådgiver",{"v":1,"d":"100%"},{"v":40000,"d":"kr 40,000.00"},{"$f":"$AM4+$J4","v":{"v":646000,"d":"kr 646,000.00"}},{"$f":"$AM4/$J4","v":{"v":0.066006600660066,"d":"6.60%"}},{"$f":"$AN4-$H4","v":{"v":46000,"d":"kr 46,000.00"}},{"$f":"$AP4/$H4","v":{"v":0.07666666666666666,"d":"7.67%"}},null,"Seniorrådgiver",{"v":1,"d":"100%"},{"v":20000,"d":"kr 20,000.00"},{"$f":"$AU4+$J4","v":{"v":626000,"d":"kr 626,000.00"}},{"$f":"$AU4/$J4","v":{"v":0.033003300330033,"d":"3.30%"}},{"$f":"$AV4-$H4","v":{"v":26000,"d":"kr 26,000.00"}},{"$f":"$AX4/$H4","v":{"v":0.043333333333333335,"d":"4.33%"}},{"$f":"AU4-BC4","v":{"v":-7000,"d":"-kr 7,000.00"}},"Seniorrådgiver",{"v":1,"d":"100%"},{"v":27000,"d":"kr 27,000.00"},{"$f":"$BC4+$J4","v":{"v":633000,"d":"kr 633,000.00"}},{"$f":"$BC4/$J4","v":{"v":0.04455445544554455,"d":"4.46%"}},{"$f":"$BD4-$H4","v":{"v":33000,"d":"kr 33,000.00"}},{"$f":"$BF4/$H4","v":{"v":0.055,"d":"5.50%"}},null,"Seniorrådgiver",{"v":1,"d":"100%"},{"v":22250,"d":"kr 22,250.00"},{"$f":"$BK4+$J4","v":{"v":628250,"d":"kr 628,250.00"}},{"$f":"$BK4/$J4","v":{"v":0.036716171617161716,"d":"3.67%"}},{"$f":"$BL4-$H4","v":{"v":28250,"d":"kr 28,250.00"}},{"$f":"$BN4/$H4","v":{"v":0.04708333333333333,"d":"4.71%"}},{"$f":"BK4-BS4","v":{"v":-2750,"d":"-kr 2,750.00"}},"Seniorrådgiver",{"v":1,"d":"100%"},{"v":25000,"d":"kr 25,000.00"},{"$f":"$BS4+$J4","v":{"v":631000,"d":"kr 631,000.00"}},{"$f":"$BS4/$J4","v":{"v":0.041254125412541254,"d":"4.13%"}},{"$f":"$BT4-$H4","v":{"v":31000,"d":"kr 31,000.00"}},{"$f":"$BV4/$H4","v":{"v":0.051666666666666666,"d":"5.17%"}},null,"Seniorrådgiver",{"v":1,"d":"100%"},{"v":25000,"d":"kr 25,000.00"},{"$f":"$CA4+$J4","v":{"v":631000,"d":"kr 631,000.00"}},{"$f":"$CA4/$J4","v":{"v":0.041254125412541254,"d":"4.13%"}},{"$f":"$CB4-$H4","v":{"v":31000,"d":"kr 31,000.00"}},{"$f":"$CD4/$H4","v":{"v":0.051666666666666666,"d":"5.17%"}}]
["NN2","Kvinne","Miljøterapeut",2,{"$f":"VLOOKUP(C5,Kilde!$D$2:$E$444,2)","v":"Lang"},16,{"v":0.1,"d":"10%"},{"v":700000,"d":"kr 700,000.00"},{"$f":"H5*$B$2/100","v":{"v":7000,"d":"kr 7,000.00"}},{"$f":"I5+H5","v":{"v":707000,"d":"kr 707,000.00"}},null,null,"Miljøterapeut",{"v":1,"d":"100%"},{"v":10000,"d":"kr 10,000.00"},{"$f":"$O5+$J5","v":{"v":717000,"d":"kr 717,000.00"}},{"$f":"$O5/$J5","v":{"v":0.014144271570014143,"d":"1.41%"}},{"$f":"$P5-$H5","v":{"v":17000,"d":"kr 17,000.00"}},{"$f":"$R5/$H5","v":{"v":0.024285714285714285,"d":"2.43%"}},{"$f":"O5-W5","v":{"v":5000,"d":"kr 5,000.00"}},"Miljøterapeut",{"v":1,"d":"100%"},{"v":5000,"d":"kr 5,000.00"},{"$f":"$W5+$J5","v":{"v":712000,"d":"kr 712,000.00"}},{"$f":"$W5/$J5","v":{"v":0.007072135785007072,"d":"0.71%"}},{"$f":"$X5-$H5","v":{"v":12000,"d":"kr 12,000.00"}},{"$f":"$Z5/$H5","v":{"v":0.017142857142857144,"d":"1.71%"}},null,"Miljøterapeut",{"v":1,"d":"100%"},{"v":2500,"d":"kr 2,500.00"},{"$f":"$AE5+$J5","v":{"v":709500,"d":"kr 709,500.00"}},{"$f":"$AE5/$J5","v":{"v":0.003536067892503536,"d":"0.35%"}},{"$f":"$AF5-$H5","v":{"v":9500,"d":"kr 9,500.00"}},{"$f":"$AH5/$H5","v":{"v":0.013571428571428571,"d":"1.36%"}},{"$f":"AE5-AM5","v":{"v":-5000,"d":"-kr 5,000.00"}},"Miljøterapeut",{"v":1,"d":"100%"},{"v":7500,"d":"kr 7,500.00"},{"$f":"$AM5+$J5","v":{"v":714500,"d":"kr 714,500.00"}},{"$f":"$AM5/$J5","v":{"v":0.010608203677510608,"d":"1.06%"}},{"$f":"$AN5-$H5","v":{"v":14500,"d":"kr 14,500.00"}},{"$f":"$AP5/$H5","v":{"v":0.020714285714285713,"d":"2.07%"}},null,"Miljøterapeut",{"v":1,"d":"100%"},{"v":5000,"d":"kr 5,000.00"},{"$f":"$AU5+$J5","v":{"v":712000,"d":"kr 712,000.00"}},{"$f":"$AU5/$J5","v":{"v":0.007072135785007072,"d":"0.71%"}},{"$f":"$AV5-$H5","v":{"v":12000,"d":"kr 12,000.00"}},{"$f":"$AX5/$H5","v":{"v":0.017142857142857144,"d":"1.71%"}},{"$f":"AU5-BC5","v":0},"Miljøterapeut",{"v":1,"d":"100%"},{"v":5000,"d":"kr 5,000.00"},{"$f":"$BC5+$J5","v":{"v":712000,"d":"kr 712,000.00"}},{"$f":"$BC5/$J5","v":{"v":0.007072135785007072,"d":"0.71%"}},{"$f":"$BD5-$H5","v":{"v":12000,"d":"kr 12,000.00"}},{"$f":"$BF5/$H5","v":{"v":0.017142857142857144,"d":"1.71%"}},null,"Miljøterapeut",{"v":1,"d":"100%"},{"v":5000,"d":"kr 5,000.00"},{"$f":"$BK5+$J5","v":{"v":712000,"d":"kr 712,000.00"}},{"$f":"$BK5/$J5","v":{"v":0.007072135785007072,"d":"0.71%"}},{"$f":"$BL5-$H5","v":{"v":12000,"d":"kr 12,000.00"}},{"$f":"$BN5/$H5","v":{"v":0.017142857142857144,"d":"1.71%"}},{"$f":"BK5-BS5","v":0},"Miljøterapeut",{"v":1,"d":"100%"},{"v":5000,"d":"kr 5,000.00"},{"$f":"$BS5+$J5","v":{"v":712000,"d":"kr 712,000.00"}},{"$f":"$BS5/$J5","v":{"v":0.007072135785007072,"d":"0.71%"}},{"$f":"$BT5-$H5","v":{"v":12000,"d":"kr 12,000.00"}},{"$f":"$BV5/$H5","v":{"v":0.017142857142857144,"d":"1.71%"}},null,"Miljøterapeut",{"v":1,"d":"100%"},{"v":5000,"d":"kr 5,000.00"},{"$f":"$CA5+$J5","v":{"v":712000,"d":"kr 712,000.00"}},{"$f":"$CA5/$J5","v":{"v":0.007072135785007072,"d":"0.71%"}},{"$f":"$CB5-$H5","v":{"v":12000,"d":"kr 12,000.00"}},{"$f":"$CD5/$H5","v":{"v":0.017142857142857144,"d":"1.71%"}}]
[{"$nulls":4},{"$f":"VLOOKUP(C6,Kilde!$D$2:$E$444,2)","v":{"$error":"#N/A"}},{"$nulls":3},0,0,{"$nulls":5},0,{"$error":"#DIV/0!"},0,{"$error":"#DIV/0!"},0,{"$nulls":3},0,{"$error":"#DIV/0!"},0,{"$error":"#DIV/0!"},{"$nulls":4},0,{"$error":"#DIV/0!"},0,{"$f":"$AH6/$H6","v":{"$error":"#DIV/0!"}},{"$f":"AE6-AM6","v":0},{"$nulls":3},0,{"$error":"#DIV/0!"},0,{"$error":"#DIV/0!"},{"$nulls":4},0,{"$error":"#DIV/0!"},0,{"$error":"#DIV/0!"},{"$f":"AU6-BC6","v":0},{"$nulls":3},0,{"$error":"#DIV/0!"},0,{"$error":"#DIV/0!"},{"$nulls":4},0,{"$error":"#DIV/0!"},0,{"$error":"#DIV/0!"},{"$f":"BK6-BS6","v":0},{"$nulls":3},0,{"$error":"#DIV/0!"},0,{"$error":"#DIV/0!"},{"$nulls":4},0,{"$error":"#DIV/0!"},0,{"$error":"#DIV/0!"}]
[{"$nulls":4},{"$f":"VLOOKUP(C7,Kilde!$D$2:$E$444,2)","v":{"$error":"#N/A"}},{"$nulls":3},0,0,{"$nulls":5},0,{"$error":"#DIV/0!"},0,{"$error":"#DIV/0!"},0,{"$nulls":3},0,{"$error":"#DIV/0!"},0,{"$error":"#DIV/0!"},{"$nulls":4},0,{"$error":"#DIV/0!"},0,{"$error":"#DIV/0!"},0,{"$nulls":3},0,{"$error":"#DIV/0!"},0,{"$error":"#DIV/0!"},{"$nulls":4},0,{"$error":"#DIV/0!"},0,{"$error":"#DIV/0!"},0,{"$nulls":3},0,{"$error":"#DIV/0!"},0,{"$error":"#DIV/0!"},{"$nulls":4},0,{"$error":"#DIV/0!"},0,{"$error":"#DIV/0!"},0,{"$nulls":3},0,{"$error":"#DIV/0!"},0,{"$error":"#DIV/0!"},{"$nulls":4},0,{"$error":"#DIV/0!"},0,{"$error":"#DIV/0!"}]
[{"$nulls":4},{"$f":"VLOOKUP(C8,Kilde!$D$2:$E$444,2)","v":{"$error":"#N/A"}},{"$nulls":3},0,0,{"$nulls":5},0,{"$error":"#DIV/0!"},0,{"$error":"#DIV/0!"},0,{"$nulls":3},0,{"$error":"#DIV/0!"},0,{"$error":"#DIV/0!"},{"$nulls":4},0,{"$error":"#DIV/0!"},0,{"$error":"#DIV/0!"},0,{"$nulls":3},0,{"$error":"#DIV/0!"},0,{"$error":"#DIV/0!"},{"$nulls":4},0,{"$error":"#DIV/0!"},0,{"$error":"#DIV/0!"},0,{"$nulls":3},0,{"$error":"#DIV/0!"},0,{"$error":"#DIV/0!"},{"$nulls":4},0,{"$error":"#DIV/0!"},0,{"$error":"#DIV/0!"},0,{"$nulls":3},0,{"$error":"#DIV/0!"},0,{"$error":"#DIV/0!"},{"$nulls":4},0,{"$error":"#DIV/0!"},0,{"$error":"#DIV/0!"}]
[{"$nulls":4},{"$f":"VLOOKUP(C9,Kilde!$D$2:$E$444,2)","v":{"$error":"#N/A"}},{"$nulls":3},0,0,{"$nulls":5},0,{"$error":"#DIV/0!"},0,{"$error":"#DIV/0!"},0,{"$nulls":3},0,{"$error":"#DIV/0!"},0,{"$error":"#DIV/0!"},{"$nulls":4},0,{"$error":"#DIV/0!"},0,{"$error":"#DIV/0!"},0,{"$nulls":3},0,{"$error":"#DIV/0!"},0,{"$error":"#DIV/0!"},{"$nulls":4},0,{"$error":"#DIV/0!"},0,{"$error":"#DIV/0!"},0,{"$nulls":3},0,{"$error":"#DIV/0!"},0,{"$error":"#DIV/0!"},{"$nulls":4},0,{"$error":"#DIV/0!"},0,{"$error":"#DIV/0!"},0,{"$nulls":3},0,{"$error":"#DIV/0!"},0,{"$error":"#DIV/0!"},{"$nulls":4},0,{"$error":"#DIV/0!"},0,{"$error":"#DIV/0!"}]
[{"$nulls":4},{"$f":"VLOOKUP(C10,Kilde!$D$2:$E$444,2)","v":{"$error":"#N/A"}},{"$nulls":3},0,0,{"$nulls":5},0,{"$error":"#DIV/0!"},0,{"$error":"#DIV/0!"},0,{"$nulls":3},0,{"$error":"#DIV/0!"},0,{"$error":"#DIV/0!"},{"$nulls":4},0,{"$error":"#DIV/0!"},{"$f":"$AF10-$H10","v":0},{"$error":"#DIV/0!"},0,{"$nulls":3},0,{"$error":"#DIV/0!"},0,{"$error":"#DIV/0!"},{"$nulls":4},0,{"$error":"#DIV/0!"},0,{"$error":"#DIV/0!"},0,{"$nulls":3},0,{"$error":"#DIV/0!"},0,{"$error":"#DIV/0!"},{"$nulls":4},0,{"$error":"#DIV/0!"},0,{"$error":"#DIV/0!"},0,{"$nulls":3},0,{"$error":"#DIV/0!"},0,{"$error":"#DIV/0!"},{"$nulls":4},0,{"$error":"#DIV/0!"},0,{"$error":"#DIV/0!"}]
[{"$nulls":4},{"$f":"VLOOKUP(C11,Kilde!$D$2:$E$444,2)","v":{"$error":"#N/A"}},{"$nulls":3},0,0,{"$nulls":5},0,{"$error":"#DIV/0!"},0,{"$error":"#DIV/0!"},0,{"$nulls":3},0,{"$error":"#DIV/0!"},0,{"$error":"#DIV/0!"},{"$nulls":4},0,{"$error":"#DIV/0!"},0,{"$error":"#DIV/0!"},0,{"$nulls":3},0,{"$error":"#DIV/0!"},0,{"$error":"#DIV/0!"},{"$nulls":4},0,{"$error":"#DIV/0!"},0,{"$error":"#DIV/0!"},0,{"$nulls":3},0,{"$error":"#DIV/0!"},0,{"$error":"#DIV/0!"},{"$nulls":4},0,{"$error":"#DIV/0!"},0,{"$error":"#DIV/0!"},0,{"$nulls":3},0,{"$error":"#DIV/0!"},0,{"$error":"#DIV/0!"},{"$nulls":4},0,{"$error":"#DIV/0!"},0,{"$error":"#DIV/0!"}]
[{"$nulls":4},{"$f":"VLOOKUP(C12,Kilde!$D$2:$E$444,2)","v":{"$error":"#N/A"}},{"$nulls":3},0,0,{"$nulls":5},0,{"$error":"#DIV/0!"},0,{"$error":"#DIV/0!"},0,{"$nulls":3},0,{"$error":"#DIV/0!"},0,{"$error":"#DIV/0!"},{"$nulls":4},0,{"$error":"#DIV/0!"},0,{"$error":"#DIV/0!"},0,{"$nulls":3},0,{"$error":"#DIV/0!"},0,{"$error":"#DIV/0!"},{"$nulls":4},0,{"$error":"#DIV/0!"},0,{"$error":"#DIV/0!"},0,{"$nulls":3},0,{"$error":"#DIV/0!"},0,{"$error":"#DIV/0!"},{"$nulls":4},0,{"$error":"#DIV/0!"},0,{"$error":"#DIV/0!"},0,{"$nulls":3},0,{"$error":"#DIV/0!"},0,{"$error":"#DIV/0!"},{"$nulls":4},0,{"$error":"#DIV/0!"},0,{"$error":"#DIV/0!"}]
[{"$nulls":4},{"$f":"VLOOKUP(C13,Kilde!$D$2:$E$444,2)","v":{"$error":"#N/A"}},{"$nulls":3},0,0,{"$nulls":5},0,{"$error":"#DIV/0!"},0,{"$error":"#DIV/0!"},0,{"$nulls":3},0,{"$error":"#DIV/0!"},0,{"$error":"#DIV/0!"},{"$nulls":4},0,{"$error":"#DIV/0!"},0,{"$error":"#DIV/0!"},0,{"$nulls":3},0,{"$error":"#DIV/0!"},0,{"$error":"#DIV/0!"},{"$nulls":4},0,{"$error":"#DIV/0!"},0,{"$error":"#DIV/0!"},0,{"$nulls":3},0,{"$error":"#DIV/0!"},0,{"$error":"#DIV/0!"},{"$nulls":4},0,{"$error":"#DIV/0!"},0,{"$error":"#DIV/0!"},0,{"$nulls":3},0,{"$error":"#DIV/0!"},0,{"$error":"#DIV/0!"},{"$nulls":4},0,{"$error":"#DIV/0!"},0,{"$error":"#DIV/0!"}]
[{"$nulls":4},{"$f":"VLOOKUP(C14,Kilde!$D$2:$E$444,2)","v":{"$error":"#N/A"}},{"$nulls":3},0,0,{"$nulls":5},0,{"$error":"#DIV/0!"},0,{"$error":"#DIV/0!"},0,{"$nulls":3},0,{"$error":"#DIV/0!"},0,{"$error":"#DIV/0!"},{"$nulls":4},0,{"$error":"#DIV/0!"},0,{"$error":"#DIV/0!"},0,{"$nulls":3},0,{"$error":"#DIV/0!"},0,{"$error":"#DIV/0!"},{"$nulls":4},0,{"$error":"#DIV/0!"},0,{"$error":"#DIV/0!"},0,{"$nulls":3},0,{"$error":"#DIV/0!"},0,{"$error":"#DIV/0!"},{"$nulls":4},0,{"$error":"#DIV/0!"},0,{"$error":"#DIV/0!"},0,{"$nulls":3},0,{"$error":"#DIV/0!"},0,{"$error":"#DIV/0!"},{"$nulls":4},0,{"$error":"#DIV/0!"},0,{"$error":"#DIV/0!"}]
[{"$nulls":4},{"$f":"VLOOKUP(C15,Kilde!$D$2:$E$444,2)","v":{"$error":"#N/A"}},{"$nulls":3},0,0,{"$nulls":5},0,{"$error":"#DIV/0!"},0,{"$error":"#DIV/0!"},0,{"$nulls":3},0,{"$error":"#DIV/0!"},0,{"$error":"#DIV/0!"},{"$nulls":4},0,{"$error":"#DIV/0!"},0,{"$error":"#DIV/0!"},0,{"$nulls":3},0,{"$error":"#DIV/0!"},0,{"$error":"#DIV/0!"},{"$nulls":4},0,{"$error":"#DIV/0!"},0,{"$error":"#DIV/0!"},0,{"$nulls":3},0,{"$error":"#DIV/0!"},0,{"$error":"#DIV/0!"},{"$nulls":4},0,{"$error":"#DIV/0!"},0,{"$error":"#DIV/0!"},0,{"$nulls":3},0,{"$error":"#DIV/0!"},0,{"$error":"#DIV/0!"},{"$nulls":4},0,{"$error":"#DIV/0!"},0,{"$error":"#DIV/0!"}]
[{"$nulls":4},{"$f":"VLOOKUP(C16,Kilde!$D$2:$E$444,2)","v":{"$error":"#N/A"}},{"$nulls":3},0,0,{"$nulls":5},0,{"$error":"#DIV/0!"},0,{"$error":"#DIV/0!"},0,{"$nulls":3},0,{"$error":"#DIV/0!"},0,{"$error":"#DIV/0!"},{"$nulls":4},0,{"$error":"#DIV/0!"},0,{"$error":"#DIV/0!"},0,{"$nulls":3},0,{"$error":"#DIV/0!"},0,{"$error":"#DIV/0!"},{"$nulls":4},0,{"$error":"#DIV/0!"},0,{"$error":"#DIV/0!"},0,{"$nulls":3},0,{"$error":"#DIV/0!"},0,{"$error":"#DIV/0!"},{"$nulls":4},0,{"$error":"#DIV/0!"},0,{"$error":"#DIV/0!"},0,{"$nulls":3},0,{"$error":"#DIV/0!"},0,{"$error":"#DIV/0!"},{"$nulls":4},0,{"$error":"#DIV/0!"},0,{"$error":"#DIV/0!"}]
[{"$nulls":4},{"$f":"VLOOKUP(C17,Kilde!$D$2:$E$444,2)","v":{"$error":"#N/A"}},{"$nulls":3},0,0,{"$nulls":5},0,{"$error":"#DIV/0!"},0,{"$error":"#DIV/0!"},0,{"$nulls":3},0,{"$error":"#DIV/0!"},0,{"$error":"#DIV/0!"},{"$nulls":4},0,{"$error":"#DIV/0!"},0,{"$error":"#DIV/0!"},0,{"$nulls":3},0,{"$error":"#DIV/0!"},0,{"$error":"#DIV/0!"},{"$nulls":4},0,{"$error":"#DIV/0!"},0,{"$error":"#DIV/0!"},0,{"$nulls":3},0,{"$error":"#DIV/0!"},0,{"$error":"#DIV/0!"},{"$nulls":4},0,{"$error":"#DIV/0!"},0,{"$error":"#DIV/0!"},0,{"$nulls":3},0,{"$error":"#DIV/0!"},0,{"$error":"#DIV/0!"},{"$nulls":4},0,{"$error":"#DIV/0!"},0,{"$error":"#DIV/0!"}]
[{"$nulls":4},{"$f":"VLOOKUP(C18,Kilde!$D$2:$E$444,2)","v":{"$error":"#N/A"}},{"$nulls":3},0,0,{"$nulls":5},0,{"$error":"#DIV/0!"},0,{"$error":"#DIV/0!"},0,{"$nulls":3},0,{"$error":"#DIV/0!"},0,{"$error":"#DIV/0!"},{"$nulls":4},0,{"$error":"#DIV/0!"},0,{"$error":"#DIV/0!"},0,{"$nulls":3},0,{"$error":"#DIV/0!"},0,{"$error":"#DIV/0!"},{"$nulls":4},0,{"$error":"#DIV/0!"},0,{"$error":"#DIV/0!"},0,{"$nulls":3},0,{"$error":"#DIV/0!"},0,{"$error":"#DIV/0!"},{"$nulls":4},0,{"$error":"#DIV/0!"},0,{"$error":"#DIV/0!"},0,{"$nulls":3},0,{"$error":"#DIV/0!"},0,{"$error":"#DIV/0!"},{"$nulls":4},0,{"$error":"#DIV/0!"},0,{"$error":"#DIV/0!"}]
[{"$nulls":4},{"$f":"VLOOKUP(C19,Kilde!$D$2:$E$444,2)","v":{"$error":"#N/A"}},{"$nulls":3},0,0,{"$nulls":5},0,{"$error":"#DIV/0!"},0,{"$error":"#DIV/0!"},0,{"$nulls":3},0,{"$error":"#DIV/0!"},0,{"$error":"#DIV/0!"},{"$nulls":4},0,{"$error":"#DIV/0!"},0,{"$error":"#DIV/0!"},0,{"$nulls":3},0,{"$error":"#DIV/0!"},0,{"$error":"#DIV/0!"},{"$nulls":4},0,{"$error":"#DIV/0!"},0,{"$error":"#DIV/0!"},0,{"$nulls":3},0,{"$error":"#DIV/0!"},0,{"$error":"#DIV/0!"},{"$nulls":4},0,{"$error":"#DIV/0!"},0,{"$error":"#DIV/0!"},0,{"$nulls":3},0,{"$error":"#DIV/0!"},0,{"$error":"#DIV/0!"},{"$nulls":4},0,{"$error":"#DIV/0!"},0,{"$error":"#DIV/0!"}]
[{"$nulls":4},{"$f":"VLOOKUP(C20,Kilde!$D$2:$E$444,2)","v":{"$error":"#N/A"}},{"$nulls":3},0,0,{"$nulls":5},0,{"$error":"#DIV/0!"},0,{"$error":"#DIV/0!"},0,{"$nulls":3},0,{"$error":"#DIV/0!"},0,{"$error":"#DIV/0!"},{"$nulls":4},0,{"$error":"#DIV/0!"},0,{"$error":"#DIV/0!"},0,{"$nulls":3},0,{"$error":"#DIV/0!"},0,{"$error":"#DIV/0!"},{"$nulls":4},0,{"$error":"#DIV/0!"},0,{"$error":"#DIV/0!"},0,{"$nulls":3},0,{"$error":"#DIV/0!"},0,{"$error":"#DIV/0!"},{"$nulls":4},0,{"$error":"#DIV/0!"},0,{"$error":"#DIV/0!"},0,{"$nulls":3},0,{"$error":"#DIV/0!"},0,{"$error":"#DIV/0!"},{"$nulls":4},0,{"$error":"#DIV/0!"},0,{"$error":"#DIV/0!"}]
{"$rows_left_out":27}
{"sheet":"Kilde","index":1,"n_rows":444,"n_cols":10,"rows_kept":444}
["Kjønn",null,"SKO","STILLING","LØNNSSTIGE",null,null,"Lønnsstige",null,"Ja"]
["Mann ",null,1554,"Avdelingssjef hos Sivilombudet","Direkte pl. ",null,null,"Direkte pl. ",null,"Nei"]
["Kvinne",null,962,"Adjunkt","Lang",null,null,"Lang"]
[null,null,963,"Adjunkt med opprykk ","Lang",null,null,"Kort"]
[null,null,1058,"Administrasjonssjef","Direkte pl. "]
[null,null,258,"Advokat ","Direkte pl. "]
[null,null,1478,"Advokat med møterett for Høyesterett","Direkte pl. "]
[null,null,257,"Advokatfullmektig","Direkte pl. "]
[null,null,1010,"Amanuensis","Lang"]
[null,null,1507,"Ambassadør ","Direkte pl. "]
[null,null,1118,"Arbeidsleder","Direkte pl. "]
[null,null,1092,"Arkitekt","Kort 1)"]
[null,null,1072,"Arkivleder","Direkte pl. "]
[null,null,1531,"Arrestforvarer","Lang"]
[null,null,1429,"Aspirant","Direkte pl. "]
[null,null,1502,"Ass. fengselsleder","Direkte pl. "]
[null,null,1503,"Ass. friomsorgsleder","Direkte pl. "]
[null,null,774,"Ass. fylkeslege","Direkte pl. "]
[null,null,1491,"Ass. leder","Direkte pl. "]
[null,null,261,"Ass. sysselmester","Direkte pl. "]
{"$rows_left_out":424}